Repository navigation
feat(files): add the Project file backend and APIs #35913
ci.yml
on: pull_request
checks
/
changes
14s
version
desktop-changes
0s
trigger-upload
0s
Matrix: image-amd64
Matrix: image-arm64
Matrix: image-dev
checks
/
lint
1m 10s
docs-changes
0s
migrate-dev
/
migrate
Matrix: checks / e2e
Matrix: checks / integration
Matrix: checks / test
checks
/
desktop-live
10m 3s
checks
/
test-types
1m 15s
checks
/
build
3m 58s
Matrix: checks / e2e-mobile
prerelease-prune
Matrix: attest
desktop-release
/
build
Annotations
11 errors, 33 warnings, and 1 notice
|
checks / test (1/2)
Process completed with exit code 1.
|
|
scripts/check-project-rollout.test.ts > Project column rollout release acknowledgement > rejects a newer deployment discovered i…:
scripts/check-project-rollout.test.ts#L107
AssertionError: expected 2 to be 1 // Object.is equality
- Expected
+ Received
- 1
+ 2
❯ scripts/check-project-rollout.test.ts:107:46
|
|
scripts/check-project-rollout.test.ts > Project column rollout release acknowledgement > rejects a newer pending release even wh…:
scripts/check-project-rollout.test.ts#L107
AssertionError: expected 2 to be 1 // Object.is equality
- Expected
+ Received
- 1
+ 2
❯ scripts/check-project-rollout.test.ts:107:46
|
|
scripts/check-project-rollout.test.ts > Project column rollout release acknowledgement > rejects a stale acknowledgement after a…:
scripts/check-project-rollout.test.ts#L107
AssertionError: expected 2 to be 1 // Object.is equality
- Expected
+ Received
- 1
+ 2
❯ scripts/check-project-rollout.test.ts:107:46
|
|
scripts/check-project-rollout.test.ts > Project column rollout release acknowledgement > accepts the latest completed acknowledg…:
scripts/check-project-rollout.test.ts#L100
AssertionError: python3: can't open file '/home/runner/_work/sim/sim/.github/scripts/check-project-rollout.py': [Errno 2] No such file or directory
: expected 2 to be +0 // Object.is equality
- Expected
+ Received
- 0
+ 2
❯ scripts/check-project-rollout.test.ts:100:46
|
|
checks / lint
Process completed with exit code 1.
|
|
check:test-patterns
audit failed — see the group above
|
|
checks / lint
Process completed with exit code 1.
|
|
checks / test-types
Process completed with exit code 1.
|
|
checks / ci
Process completed with exit code 1.
|
|
checks / ci
Checks did not pass:
|
|
checks / test (1/2)
[git-mirror] Skipping cache commit: Found 2 failed/cancelled steps
|
|
checks / test (1/2)
[git-mirror] - Step: unknown (failed)
|
|
checks / test (1/2)
Skipping sticky disk commit due to previous step failures
|
|
checks / test (1/2)
- Step: unknown (failed)
|
|
checks / test (1/2)
Found 2 failed/cancelled steps in previous workflow steps
|
|
checks / test (1/2)
Skipping sticky disk commit due to previous step failures
|
|
checks / test (1/2)
- Step: unknown (failed)
|
|
checks / test (1/2)
Found 2 failed/cancelled steps in previous workflow steps
|
|
checks / test (1/2)
Skipping sticky disk commit due to previous step failures
|
|
checks / test (1/2)
- Step: unknown (failed)
|
|
checks / test (1/2)
Found 2 failed/cancelled steps in previous workflow steps
|
|
checks / lint
[git-mirror] Skipping cache commit: Found 2 failed/cancelled steps
|
|
checks / lint
[git-mirror] - Step: unknown (failed)
|
|
checks / lint
Skipping sticky disk commit due to previous step failures
|
|
checks / lint
- Step: unknown (failed)
|
|
checks / lint
Found 2 failed/cancelled steps in previous workflow steps
|
|
checks / lint
Skipping sticky disk commit due to previous step failures
|
|
checks / lint
- Step: unknown (failed)
|
|
checks / lint
Found 2 failed/cancelled steps in previous workflow steps
|
|
checks / lint
Skipping sticky disk commit due to previous step failures
|
|
checks / lint
- Step: unknown (failed)
|
|
checks / lint
Found 2 failed/cancelled steps in previous workflow steps
|
|
checks / test-types
[git-mirror] Skipping cache commit: Found 2 failed/cancelled steps
|
|
checks / test-types
[git-mirror] - Step: unknown (failed)
|
|
checks / test-types
Skipping sticky disk commit due to previous step failures
|
|
checks / test-types
- Step: unknown (failed)
|
|
checks / test-types
Found 2 failed/cancelled steps in previous workflow steps
|
|
checks / test-types
Skipping sticky disk commit due to previous step failures
|
|
checks / test-types
- Step: unknown (failed)
|
|
checks / test-types
Found 2 failed/cancelled steps in previous workflow steps
|
|
Slow Test:
apps/desktop/e2e/desktop-tools-live-sim.spec.ts#L0
apps/desktop/e2e/desktop-tools-live-sim.spec.ts took 6.8m
|
|
checks / ci
[git-mirror] Skipping cache commit: Found 2 failed/cancelled steps
|
|
checks / ci
[git-mirror] - Step: unknown (failed)
|
|
🎭 Playwright Run Summary
12 passed (7.8m)
|